{"text_format":"1","workbook":"xlsx","n_sheets":14,"sheets":["Application Information","Table of Contents","Applicant Info","Eligibility","Project Info","Proposed Outcome Measurements","Activities","Match Funds","Project Budget","Expense Details","Budget Summary","Past Performance ","Certification","Factors."],"not_rendered":{"charts":0,"images":2,"macros":1,"external_links":1,"defined_names":27,"comments":1,"pivot_tables":0},"unopened":[],"bounds":{"document_bytes":16777216,"sheet_cells":100000,"rows_first":2000,"rows_last":500,"rows_between":2000,"halvings":0,"cell_chars":16384,"cell_head_chars":4096},"cells_cut":0,"cells_raw":0,"read":"whole","date_system":"1900"}

{"sheet":"Application Information","index":0,"n_rows":89,"n_cols":9,"rows_kept":89,"cut":false,"hidden":false,"merged":[[10,2,10,11],[18,2,18,11],[17,2,17,11],[88,3,88,5],[11,3,11,7],[12,3,12,7],[3,2,3,11],[32,2,32,11],[33,2,33,11],[34,2,34,11],[4,2,4,11],[27,2,27,11],[28,2,28,11],[6,2,6,11],[9,2,9,11],[22,2,22,11],[25,2,25,11],[26,2,26,11],[16,2,16,11]]}
[]
[]
[]
[null,null,"MISSISSIPPI HOME CORPORATION"]
[null,null,"EMERGENCY SOLUTIONS GRANT (ESG) PROGRAM"]
[]
[null,null,"FY 2020 - 2021  ESG APPLICATION"]
[]
[null,null,"APPLICATION CYCLE"]
[null,null,"Applications for the Emergency Solutions Grant (ESG) Program will be accepted during the application cycle stated below.  Applications will only be accepted during the designated dates and time.  There will not be any exceptions for late applications."]
[null,null,"FY 2020 Application Cycle"]
[null,null,null,"Application Submission Open Date:",null,null,null,null,"Monday, April 27, 2020"]
[null,null,null,"Application Submission Close Date:",null,null,null,null,"Thursday, April 30, 2020 @ 4:00 pm"]
[]
[]
{"$rows_left_out":75}
{"sheet":"Table of Contents","index":1,"n_rows":72,"n_cols":6,"rows_kept":72,"cut":false,"hidden":false,"merged":[[71,5,71,12],[5,2,5,12],[7,2,7,12],[2,2,3,12],[67,5,67,12],[69,5,69,12]]}
[]
[]
[null,null,"2020 - 2021 EMERGENCY SOLUTIONS GRANT APPLICATION"]
[]
[]
[null,null,"TABLE OF CONTENTS"]
[]
[null,null,"The following documents must be submitted with the application.  All items indexed must be tabbed and numbered accordingly.  "]
[]
[null,null,"APPLICANT:",null,null,{"$f":"IF('Applicant Info'!E17=\"\",\"\",'Applicant Info'!E17)","v":""}]
[]
[null,null,"I.","General Information"]
[]
[null,null,null,null,"1.","Cover Letter"]
[]
{"$rows_left_out":58}
{"sheet":"Applicant Info","index":2,"n_rows":96,"n_cols":17,"rows_kept":96,"cut":false,"hidden":false,"merged":[[80,10,80,12],[44,4,44,16],[67,4,67,10],[52,4,52,10],[30,4,30,9],[3,3,3,16],[4,3,4,16],[5,3,5,16],[9,2,9,16],[16,12,16,13],[16,14,16,16],[16,4,16,10],[28,4,28,7],[22,4,22,16],[18,4,18,7],[19,4,19,7],[26,4,26,7],[26,14,26,16],[28,14,28,16],[46,4,46,7],[46,9,46,10],[18,9,18,10],[19,9,19,10],[20,4,20,7],[82,10,82,12],[83,10,83,12],[84,10,84,12],[85,10,85,12],[86,10,86,12],[87,3,87,5],[88,3,88,5],[82,6,82,9],[83,6,83,9],[84,6,84,9],[20,9,20,10],[21,4,21,7],[21,9,21,10],[39,3,39,16],[73,3,73,16],[24,4,24,7],[24,10,24,16],[79,10,79,12],[47,9,47,10],[75,6,75,7],[81,10,81,12],[89,10,89,12],[78,3,78,16],[48,4,48,7],[50,4,50,7],[63,4,63,7],[65,4,65,7],[59,4,59,16],[61,4,61,7],[61,9,61,10],[79,6,79,9],[79,3,79,5],[62,9,62,10],[80,6,80,9],[81,6,81,9],[89,6,89,9],[80,3,80,5],[81,3,81,5],[89,3,89,5],[82,3,82,5],[83,3,83,5],[84,3,84,5],[87,10,87,12],[88,10,88,12],[111,6,111,9],[93,3,93,16],[95,10,95,16],[96,10,96,16],[97,10,97,16],[98,10,98,16],[98,3,98,5],[97,3,97,5],[97,6,97,9],[99,10,99,16],[100,10,100,16],[101,10,101,16],[102,10,102,16],[103,10,103,16],[108,10,108,16],[109,10,109,16],[110,10,110,16],[111,10,111,16],[95,3,95,5],[95,6,95,9],[96,3,96,5],[108,6,108,9],[109,6,109,9],[110,6,110,9],[104,6,104,9],[105,6,105,9],[106,6,106,9],[107,6,107,9],[96,6,96,9],[98,6,98,9],[99,6,99,9],[100,6,100,9],[101,6,101,9],[102,6,102,9],[103,6,103,9],[7,2,7,17],[111,3,111,5],[99,3,99,5],[100,3,100,5],[101,3,101,5],[102,3,102,5],[106,3,106,5],[107,3,107,5],[103,3,103,5],[108,3,108,5],[109,3,109,5],[110,3,110,5],[104,3,104,5],[105,3,105,5],[104,10,104,16],[105,10,105,16],[106,10,106,16],[107,10,107,16],[85,6,85,9],[86,6,86,9],[87,6,87,9],[88,6,88,9],[85,3,85,5],[86,3,86,5]]}
[]
[]
[]
[null,null,null,"MISSISSIPPI HOME CORPORATION"]
[null,null,null,"735 Riverside Drive |  Jackson  |  MS  |  39056"]
[null,null,null,"EMERGENCY SOLUTIONS GRANT (ESG) PROGRAM"]
[]
[null,null,"FY 2020 - 2021 ESG APPLICATION"]
[]
[null,null,"I.   APPLICANT INFORMATION"]
[]
[null,null,null,"Application Year:",1]
[]
[]
[null,null,null,"Agency"]
{"$rows_left_out":82}
{"sheet":"Eligibility","index":3,"n_rows":21,"n_cols":15,"rows_kept":21,"cut":false,"hidden":false,"merged":[[2,1,2,15],[1,1,1,15],[11,3,11,11],[7,3,7,11],[8,3,8,11],[9,3,9,11],[10,3,10,11],[18,3,18,11],[19,3,19,11],[20,3,20,11],[12,3,12,11],[13,3,13,11],[14,3,14,11],[15,3,15,11],[16,3,16,11],[17,3,17,11]]}
[]
[null,"II.   ELIGIBILITY"]
[]
[null,{"$f":"IF('Applicant Info'!E17=\"\",\"\",'Applicant Info'!E17)","v":""},null,null,null,null,null,null,null,null,null,null,null,null,{"$f":"'Applicant Info'!C8","v":"FY 2020 - 2021 ESG APPLICATION"}]
[]
[null,null,"Answer the following questions:"]
[]
[null,null,"1.","Applicant has a written policy designed to ensure that their facility is free from illegal use, possession, or distribution of drugs or alcohol by its beneficiaries and employees.  Attach documentation."]
[null,null,"2.","Applicant has a written policy to ensure that activities conducted under ESG conforms to the nondisrimination and equal opportunity requirements contained in 24 CFR Part  576.407(a).  Attach documentation."]
[null,null,"3.","Applicant will make known that use of the facilities, assistance and services are available to all individuals on a  nondiscrimantory basis per 24 CFR Part 576.407(b)."]
[null,null,"4.","Applicant has policy outlining the confidentiality of victims of domestic violence and the location of shelters for such persons.  Attach documentation."]
[null,null,"5.","If Applicant is a primarily religious organization, do you agree to provide all eligible activities under this program in a manner that is free from religious influences in accordance with 24 CFR Part 576.406."]
[null,null,"6.","If the Applicant is a nonprofit organization, do you have approval of the proposed project from the unit of general local government?  Attach documentation."]
[null,null,"7.","Is the amount of match, consisting of funds, value of service, value of building, or value of materials to be provided, equal to or greater than the ESG funds requested?"]
[null,null,"8.","If the proposed grant is for street outreach, emergency shelter operations, homeless prevention, rapid re-housing, housing relocation or short to medium-term rental assistance, the Applicant agrees to provide services or shelter to homeless individuals and families at least for the period during which ESG funds are provided."]
{"$rows_left_out":7}
{"sheet":"Project Info","index":4,"n_rows":65,"n_cols":21,"rows_kept":65,"cut":false,"hidden":false,"merged":[[53,3,53,20],[54,3,54,20],[56,3,56,20],[1,1,1,22],[2,1,2,22],[11,3,11,9],[12,3,12,9],[49,14,49,19],[6,5,6,12],[30,3,30,20],[32,3,32,20],[33,3,33,20],[59,3,59,20],[57,3,57,20],[60,3,60,20],[65,3,65,20],[69,3,69,13],[69,16,69,17]]}
[]
[null,"III.   PROJECT INFORMATION"]
[null,"The Project Information sectionn as well as the Project Narrative must accurately describe the proposed project and how the requested ESG funds will be used.  Applicants must provide clear and concise answers to all questions.."]
[null,{"$f":"IF('Applicant Info'!E17=\"\",\"\",'Applicant Info'!E17)","v":""},null,null,null,null,null,null,null,null,null,null,null,null,null,null,null,null,null,null,{"$f":"Eligibility!O4","v":"FY 2020 - 2021 ESG APPLICATION"}]
[]
[]
[null,null,"Project Name:"]
[]
[]
[null,null,"Type of services to be provided?  (Check all that apply.)"]
[]
[null,null,null,"Services for At-risk Children/Youth/Victim ",null,null,null,null,null,null,null,"Adult Education"]
[null,null,null,"of Human Trafficking",null,null,null,null,null,null,null,"Utility Assistance"]
[null,null,null,"Service for Persons with Serious Mental Illness",null,null,null,null,null,null,null,"Financial Literacy"]
[null,null,null,"Homeless Services",null,null,null,null,null,null,null,"Services for Persons Recently Incarcerate or on Parole"]
{"$rows_left_out":51}
{"sheet":"Proposed Outcome Measurements","index":5,"n_rows":27,"n_cols":19,"rows_kept":27,"cut":false,"hidden":false,"merged":[[19,2,19,18],[11,3,11,7],[12,3,12,7],[13,3,13,7],[1,1,1,19],[2,1,2,19],[8,15,8,16],[8,17,8,18],[8,9,8,10],[8,11,8,12],[8,13,8,14],[10,3,10,7],[21,9,21,10],[21,11,21,12],[21,13,21,14],[21,15,21,16],[21,17,21,18]]}
[]
[null,"IV.   PROPOSED PERFORMANCE OUTCOME MEASUREMENTS"]
[null,"Proposed Performance Outcome Measurement should reflect the needs and goals expected to be met during the activity period.  (Enter \"N/A\" for indicators that do not apply to your project)."]
[null,{"$f":"IF('Applicant Info'!E17=\"\",\"\",'Applicant Info'!E17)","v":""},null,null,null,null,null,null,null,null,null,null,null,null,null,null,null,null,{"$f":"Eligibility!O4","v":"FY 2020 - 2021 ESG APPLICATION"}]
[]
[null,null,"Persons/Households to be Served"]
[null,null,"Enter the expected outcome for the number of persons and/or households (HH) to be served within the grant period for each quarter."]
[]
[null,null,null,null,null,null,null,null,null,"Q1",null,"Q2",null,"Q3",null,"Q4",null,"TOTAL"]
[null,null,null,null,null,null,null,null,null,"Persons","HH","Persons","HH","Persons","HH","Persons","HH","Persons","HH"]
[null,null,null,"Proposed number of person(s) or households to be served?",null,null,null,null,null,null,null,null,null,null,null,null,null,{"$f":"J11+L11+N11+P11","v":0},{"$f":"K11+M11+O11+Q11","v":0}]
[null,null,null,"Proposed number of homeless individuals and/or households that will be served by Rapid-Re-housing?",null,null,null,null,null,null,null,null,null,null,null,null,null,{"$f":"J12+L12+N12+P12","v":0},{"$f":"K12+M12+O12+Q12","v":0}]
[null,null,null,"Number of individuals and/or households that will be served by Homeless Prevention funding?",null,null,null,null,null,null,null,null,null,null,null,null,null,0,0]
[null,null,null,"Number of individuals and or households that will be sheltered?",null,null,null,null,null,null,null,null,null,null,null,null,null,0,0]
[null,null,null,"Total Individuals/Households to be served:",null,null,null,null,null,{"$f":"SUM(J11:J14)","v":0},0,0,0,0,0,0,0,0,0]
{"$rows_left_out":13}
{"sheet":"Activities","index":6,"n_rows":154,"n_cols":18,"rows_kept":154,"cut":false,"hidden":false,"merged":[[6,2,6,17],[54,4,54,17],[1,1,1,18],[2,1,2,18],[70,3,70,18],[71,3,71,18],[19,3,19,6],[24,3,24,6],[64,1,64,18],[31,3,31,16],[67,2,67,18],[101,4,101,18],[109,4,109,18],[113,3,113,18],[115,3,115,18],[72,3,72,18],[73,3,73,18],[74,3,74,18],[76,3,76,18],[84,3,84,18],[75,3,75,18],[80,2,80,18],[92,2,92,18],[91,2,91,6],[153,3,153,18],[129,2,129,8],[53,3,53,11],[129,10,129,12],[120,2,120,18],[122,2,122,18],[124,2,124,18],[66,2,66,6],[79,2,79,6],[117,2,117,7],[117,8,117,10],[130,2,130,18],[139,4,139,18],[147,4,147,18],[151,3,151,18],[118,2,118,18]]}
[]
[null,"V.   ACTIVITIES"]
[null,"Activities funded under this section must comply with HUD's standards on participation, data collection, and reporting under a local HMIS.  Applicants should review 24 CFR, Part 576 and MHC's ESG Program Description for clarification and details on services."]
[null,{"$f":"IF('Applicant Info'!E17=\"\",\"\",'Applicant Info'!E17)","v":""},null,null,null,null,null,null,null,null,null,null,null,null,null,null,null,{"$f":"Eligibility!O4","v":"FY 2020 - 2021 ESG APPLICATION"}]
[]
[null,null,"1.  What counties does the Agency propose to serve with this funding?"]
[]
[]
[null,null,"2.  Population to be served:  (Select all that apply)"]
[]
[null,null,null,"Elderly",null,null,null,null,null,null,null,"Domestic Violence Victims"]
[null,null,null,"Homeless individuals and/or households",null,null,null,null,null,null,null,"Individuals and/or households with serious mental illness"]
[null,null,null,"At-risk of homelessness individuals and/or households",null,null,null,null,null,null,null,"Individuals and/or households with substance abuse issues"]
[null,null,null,"Low Income individuals and/or households",null,null,null,null,null,null,null,"Victims of human trafficking"]
[null,null,null,"Homeless Youth",null,null,null,null,null,null,null,"Other (please explain in the Project Narrative)"]
{"$rows_left_out":140}
{"sheet":"Match Funds","index":7,"n_rows":76,"n_cols":13,"rows_kept":76,"cut":false,"hidden":false,"merged":[[30,2,30,8],[20,10,20,12],[21,10,21,12],[23,2,23,8],[24,2,24,8],[25,2,25,8],[26,2,26,8],[27,2,27,8],[23,10,23,12],[24,10,24,12],[25,10,25,12],[26,10,26,12],[27,10,27,12],[28,10,28,12],[29,10,29,12],[30,10,30,12],[28,2,28,8],[29,2,29,8],[1,1,1,13],[2,1,2,13],[21,2,21,8],[22,2,22,8],[18,2,18,12],[6,2,6,12],[9,3,9,4],[10,3,10,4],[11,3,11,4],[12,3,12,4],[13,3,13,4],[22,10,22,12],[17,2,17,4]]}
[]
[null,"VI.   MATCH FUNDS"]
[null,"ESG funds require a 100% dollar for dollar match. Matching funds must equal or exceed the total ESG funding request.  In addition, at least 25% of the Total Funds Request must be matched with liquid assets."]
[null,{"$f":"IF('Applicant Info'!E17=\"\",\"\",'Applicant Info'!E17)","v":""},null,null,null,null,null,null,null,null,null,null,{"$f":"Eligibility!O4","v":"FY 2020 - 2021 ESG APPLICATION"}]
[]
[null,null,"Funding Request"]
[null,null,"Below is the list of eligible activities selected in the Activities section of the application.  Enter the amount of funds being requested for each activity.  Request only those funds expected to be expended over the twelve (12) month contract period.  Round to the nearest dollar ($1.00)."]
[]
[null,null,null,null,null,null,null,null,null,"Amount Requested"]
[null,null,null,{"$f":"IF(Activities!C20=TRUE,\"X\",\"\")","v":""},null,"  Street Outreach",null,null,null,0]
[null,null,null,{"$f":"IF(Activities!C25=TRUE,\"X\",\"\")","v":""},null,"  Emergency Shelter",null,null,null,0]
[null,null,null,{"$f":"IF(Activities!C43=TRUE,\"X\",\"\")","v":""},null,"  Rapid Re-housing",null,null,null,0]
[null,null,null,{"$f":"IF(Activities!C32=TRUE,\"X\",\"\")","v":""},null,"  Homelessness Prevention",null,null,null,0]
[null,null,null,{"$f":"IF(Activities!C54=TRUE,\"X\",\"\")","v":""},null,"  HMIS",null,null,null,0]
[null,null,null,"TOTAL ESG FUNDS REQUEST:",null,null,null,null,null,{"$f":"SUM(J10:J14)","v":0}]
{"$rows_left_out":62}
{"sheet":"Project Budget","index":8,"n_rows":73,"n_cols":12,"rows_kept":73,"cut":false,"hidden":false,"merged":[[67,5,67,6],[68,5,68,6],[69,5,69,6],[2,1,2,12],[5,8,5,11],[9,2,9,6],[22,2,22,6],[38,2,38,6],[25,2,25,6],[29,2,29,6],[30,2,30,6],[31,2,31,6],[32,2,32,6],[33,2,33,6],[34,2,34,6],[36,2,36,6],[37,2,37,6],[5,2,5,6],[12,2,12,6],[13,2,13,6],[14,2,14,6],[15,2,15,6],[16,2,16,6],[17,2,17,6],[18,2,18,6],[19,2,19,6],[20,2,20,6],[21,2,21,6],[28,2,28,6],[35,2,35,6],[57,8,57,11],[42,2,43,6],[50,2,50,6],[51,2,51,6],[52,2,52,6],[53,2,53,6],[57,2,57,6],[54,2,54,6],[44,2,44,6],[45,2,45,6],[46,2,46,6],[47,2,47,6],[48,2,48,6],[49,2,49,6]]}
[]
[null,"VII.  PROJECT BUDGET "]
[null,"The Emergency Solutions Grant funding must be used in coordination with other funding sources and programs to ensure continuum of services.  The Proposed Budget must provide information on the organization's activities, resources, and expenditures projected for 2020-2021.  Complete as accurately and completely as possible.  Failure to do so may result in a reduction or denial of funding."]
[null,{"$f":"IF('Applicant Info'!E17=\"\",\"\",'Applicant Info'!E17)","v":""},null,null,null,null,null,null,null,null,null,{"$f":"Eligibility!O4","v":"FY 2020 - 2021 ESG APPLICATION"}]
[]
[null,null,"Anticipated Resources",null,null,null,null,null,"Amount Projected"]
[null,null,null,null,null,null,null,null,"First Quarter","Second Quarter","Third Quarter","Fourth Quarter"]
[null,null,"2020 Emergency Solutions Grant (ESG) Request:",null,null,null,null,null,0,0,0,0]
[]
[null,null,"ESG Matching Funds:"]
[]
[null,null,"List the funding source for all ESG matching funds.",null,null,null,null,null,"First Quarter","Second Quarter","Third Quarter","Fourth Quarter"]
[null,null,null,null,null,null,null,null,0,0,0,0]
[null,null,null,null,null,null,null,null,0,0,0,0]
[null,null,null,null,null,null,null,null,0,0,0,0]
{"$rows_left_out":59}
{"sheet":"Expense Details","index":9,"n_rows":111,"n_cols":8,"rows_kept":111,"cut":false,"hidden":false,"merged":[[6,3,6,4],[7,3,7,4],[8,3,8,4],[14,3,14,4],[15,3,15,4],[9,3,9,4],[10,3,10,4],[13,3,13,4],[5,2,5,7],[31,2,31,6],[32,2,32,6],[16,3,16,4],[45,2,45,6],[39,3,39,4],[40,3,40,4],[41,3,41,4],[42,3,42,4],[43,3,43,4],[28,2,28,3],[29,2,29,3],[30,2,30,3],[22,2,22,3],[23,2,23,3],[24,2,24,3],[25,2,25,3],[27,2,27,3],[26,2,26,3],[17,2,17,6],[19,2,19,7],[20,2,20,3],[21,2,21,3],[57,2,57,6],[52,2,52,3],[54,2,54,3],[55,2,55,3],[52,4,52,6],[54,4,54,6],[50,2,50,3],[34,2,34,7],[35,3,35,4],[36,3,36,4],[37,3,37,4],[38,3,38,4],[44,3,44,4],[53,2,53,3],[90,2,90,3],[90,4,90,6],[91,2,91,3],[91,4,91,6],[61,2,61,4],[62,2,62,4],[63,2,63,4],[64,2,64,4],[84,2,84,3],[84,4,84,6],[79,2,79,6],[81,2,81,7],[82,2,82,3],[82,4,82,6],[83,2,83,3],[83,4,83,6],[74,2,74,4],[75,2,75,4],[76,2,76,4],[77,2,77,4],[78,2,78,4],[102,2,102,3],[102,4,102,6],[103,2,103,3],[103,4,103,6],[104,2,104,3],[104,4,104,6],[110,2,110,6],[105,2,105,3],[105,4,105,6],[106,2,106,3],[106,4,106,6],[107,2,107,6],[2,2,2,7],[72,2,72,4],[73,2,73,4],[85,2,85,3],[86,2,86,3],[65,2,65,4],[66,2,66,4],[67,2,67,4],[68,2,68,4],[69,2,69,4],[70,2,70,4],[71,2,71,4],[51,2,51,3],[55,4,55,6],[56,4,56,6],[47,2,47,7],[48,2,48,3],[49,2,49,3],[48,4,48,6],[49,4,49,6],[50,4,50,6],[51,4,51,6],[60,2,60,7],[56,2,56,3],[99,2,99,3],[100,2,100,3],[101,2,101,3],[99,4,99,6],[100,4,100,6],[101,4,101,6],[87,2,87,3],[88,2,88,3],[85,4,85,6],[86,4,86,6],[87,4,87,6],[88,4,88,6],[98,2,98,3],[98,4,98,6],[92,2,92,3],[92,4,92,6],[93,2,93,6],[95,2,95,7],[96,2,96,3],[96,4,96,6],[97,2,97,3],[97,4,97,6],[89,2,89,3],[89,4,89,6]]}
[]
[null,"VIII.   EXPENSE DETAILS"]
[null,null,"Expense details breaks down all the expenses listed on the Project Budget worksheet by categories:  Salary and Wages, Fringe Benefits, Transportation, Equipment, Operating Expenses, Consultant/Contractural Costs, and Other Expenses.  The total of all expenses listed on this worksheet should coincide with the Project Budget worksheet."]
[null,{"$f":"IF('Applicant Info'!E17=\"\",\"\",'Applicant Info'!E17)","v":""},null,null,null,null,null,{"$f":"[1]Eligibility!O4","v":"FY 2020 ESG APPLICATION"}]
[]
[null,null,"I.  Salary and Wages"]
[null,null,"Position / Title","Name",null,"Annual Salary","% of time on ESG","Amount"]
[null,null,null,null,null,null,null,{"$f":"F8*G8","v":0}]
[null,null,null,null,null,null,null,{"$f":"F9*G9","v":0}]
[null,null,null,null,null,null,null,0]
[null,null,null,null,null,null,null,0]
[null,null,null,null,null,null,null,0]
[null,null,null,null,null,null,null,0]
[null,null,null,null,null,null,null,0]
[null,null,null,null,null,null,null,0]
{"$rows_left_out":97}
{"sheet":"Budget Summary","index":10,"n_rows":36,"n_cols":11,"rows_kept":36,"cut":false,"hidden":false,"merged":[[16,2,16,9],[25,2,25,8],[22,2,22,9],[13,2,13,8],[2,1,2,11],[6,2,6,8]]}
[]
[null,"IX.  BUDGET SUMMARY"]
[null,"The Emergency Solutions Grant funding must be used in coordination with other funding sources and programs to ensure continuum of services.  The Proposed Budget must provide information on the organization's activities, resources, and expenditures projected for 2020-2021.  Complete as accurately and completely as possible.  Failure to do so may result in a reduction or denial of funding."]
[null,{"$f":"IF('Applicant Info'!E17=\"\",\"\",'Applicant Info'!E17)","v":""},null,null,null,null,null,null,null,null,{"$f":"Eligibility!O4","v":"FY 2020 - 2021 ESG APPLICATION"}]
[]
[]
[null,null,"Anticipated Resources",null,null,null,null,null,null,null,"Amount Projected"]
[]
[null,null,"2020 Emergency Solutions Grant (ESG) Request",null,null,null,null,null,null,null,{"$f":"'Match Funds'!J15","v":0}]
[]
[null,null,"Cash on Hand - Project Budget Deficit",null,null,null,null,null,null,null,0]
[]
[null,null,"Total Matching Funds",null,null,null,null,null,null,null,{"$f":"'Match Funds'!J32","v":0}]
[]
[null,null,"Total Non-Matching Funds",null,null,null,null,null,null,null,{"$f":"SUM('Project Budget'!I39:L39)","v":0}]
{"$rows_left_out":22}
{"sheet":"Past Performance ","index":11,"n_rows":97,"n_cols":13,"rows_kept":97,"cut":false,"hidden":false,"merged":[[74,3,74,11],[76,3,76,9],[61,3,61,9],[1,1,1,13],[2,1,2,13],[22,2,22,12],[42,2,42,11],[44,8,44,10],[24,10,25,10],[59,2,59,11],[14,9,14,10],[16,9,16,10],[16,2,16,8],[18,9,18,10]]}
[]
[null,"X.   PAST PERFORMANCE MEASUREMENTS"]
[null,"Past Performance Measurement is a tool to capture information about program performance to determine how programs and activities are meeting established needs and goals.  (Enter \"N/A\" for indicators that do not apply to your project)."]
[null,{"$f":"IF('Applicant Info'!E17=\"\",\"\",'Applicant Info'!E17)","v":""},null,null,null,null,null,null,null,null,null,null,{"$f":"Eligibility!O4","v":"FY 2020 - 2021 ESG APPLICATION"}]
[]
[null,null,"Enter data for the reporting period listed below.  Provide a report from HMIS (or comparable system) to support the data."]
[]
[]
[null,null,null,null,null,"Reporting Period:",null,"from","2019-06-01","to","2020-05-31"]
[]
[]
[]
[null,null,"2019 ESG Funding"]
[]
[null,null,"Enter the amount of ESG funds awarded during the period listed above:",null,null,null,null,null,null,0]
{"$rows_left_out":83}
{"sheet":"Certification","index":12,"n_rows":16,"n_cols":13,"rows_kept":16,"cut":false,"hidden":false,"merged":[[13,4,13,7],[11,3,11,9],[7,2,7,12],[1,1,1,13],[2,1,2,13]]}
[]
[null,"XI.   CERTIFICATION"]
[]
[null,{"$f":"IF('Applicant Info'!E17=\"\",\"\",'Applicant Info'!E17)","v":""},null,null,null,null,null,null,null,null,null,null,{"$f":"Eligibility!O4","v":"FY 2020 - 2021 ESG APPLICATION"}]
[]
[]
[]
[null,null,"The Applicant certifies that all information in this application and all information furnished in support of this application is given for the purpose of obtaining funds under the Emergency Solutions Grant (ESG) Program and is true and complete to the best of the Applicant's knowledge and belief.  The Applicant shall not, in the provisions of services, or in any other manner, discriminate against any person on the basis of race, color, creed, religion, sex, national origin, age, familial status or handicap.  Verification of any of the information contained in this application may be obtained from any source  named herein."]
[]
[null,null,{"$f":"IF('Applicant Info'!E17=\"\",\"\",'Applicant Info'!E17)","v":""}]
[]
[null,null,"By:"]
[]
[null,null,null,"Its:"]
[]
{"$rows_left_out":2}
{"sheet":"Factors.","index":13,"n_rows":88,"n_cols":20,"rows_kept":88,"cut":false,"hidden":true,"merged":[]}
[]
[]
[]
[null,"activity_type",null,null,null,null,"Counties",null,null,null,"employment",null,null,null,"support_docs",null,null,null,null,"app_yr"]
[]
[null,"Emergency Shelter",null,null,null,null,1,null,null,null,"Part-time",null,null,null,"Commitment Letter",null,null,null,null,2020]
[null,"Street Outreach",null,null,null,null,{"$f":"G6+1","v":2},"Adams",null,null,"Full-Time",null,null,null,"Award Letter",null,null,null,null,2021]
[null,"Rapid-Re-housing",null,null,null,null,{"$f":"G7+1","v":3},"Alcorn",null,null,null,null,null,null,"Bank Statement"]
[null,"Homelessness Prevention",null,null,null,null,4,"Amite",null,null,null,null,null,null,"Other (Explain in Project Narrative)"]
[null,"HMIS",null,null,null,null,5,"Attala"]
[null,null,null,null,null,null,6,"Benton"]
[null,null,null,null,null,null,7,"Bolivar"]
[null,null,null,null,null,null,8,"Calhoun"]
[null,null,null,null,null,null,9,"Carroll"]
[null,null,null,null,null,null,10,"Chickasaw"]
{"$rows_left_out":73}